Reaction Details
TargetProtein kinase C alpha type
LigandBDBM50091247
Substrate/Competitorn/a
Meas. Tech.ChEMBL_160434 (CHEMBL762305)
Ki 2.3±n/a nM
Citation Tamamura, HBienfait, BNacro, KLewin, NEBlumberg, PMMarquez, VE Conformationally constrained analogues of diacylglycerol (DAG). 17. Contrast between sn-1 and sn-2 DAG lactones in binding to protein kinase C. J Med Chem43:3209-17 (2000) Protein kinase C alpha type
Name:Protein kinase C alpha type
Type:Enzyme
Mol. Mass.:76755.65
Organism:Homo sapiens (Human)
Description:The recombinant human PKC enzymes were produced using a baculovirus expression system in SF9 cells
Residue:672
BDBM50091247
NameBDBM50091247
Synonyms:CHEMBL110779 | Decanoic acid 2-hydroxymethyl-4-(3-methyl-butylidene)-5-oxo-tetrahydro-furan-2-ylmethyl ester
TypeSmall organic molecule
Emp. Form.C21H36O5
Mol. Mass.368.5075
SMILESCCCCCCCCCC(=O)OCC1(CO)C\C(=C\CC(C)C)C(=O)O1