Reaction Details
TargetProtein kinase C alpha type
LigandBDBM50049050
Substrate/Competitorn/a
Meas. Tech.ChEMBL_160292 (CHEMBL769620)
Ki 24±n/a nM
Citation Tamamura, HBienfait, BNacro, KLewin, NEBlumberg, PMMarquez, VE Conformationally constrained analogues of diacylglycerol (DAG). 17. Contrast between sn-1 and sn-2 DAG lactones in binding to protein kinase C. J Med Chem43:3209-17 (2000) Protein kinase C alpha type
Name:Protein kinase C alpha type
Type:Enzyme
Mol. Mass.:76755.65
Organism:Homo sapiens (Human)
Description:The recombinant human PKC enzymes were produced using a baculovirus expression system in SF9 cells
Residue:672
BDBM50049050
NameBDBM50049050
Synonyms:Acetic acid 2-hydroxymethyl-4-[(Z)-octadec-9-en-(Z)-ylidene]-5-oxo-tetrahydro-furan-2-ylmethyl ester CHEMBL321823
TypeSmall organic molecule
Emp. Form.C26H44O5
Mol. Mass.436.6246
SMILESCCCCCCCC\C=C/CCCCCCC\C=C1\CC(CO)(COC(C)=O)OC1=O