Reaction Details
TargetProtein kinase C alpha type
LigandBDBM50085904
Substrate/Competitorn/a
Meas. Tech.ChEMBL_160292 (CHEMBL769620)
Ki 2.9±n/a nM
Citation Tamamura, HBienfait, BNacro, KLewin, NEBlumberg, PMMarquez, VE Conformationally constrained analogues of diacylglycerol (DAG). 17. Contrast between sn-1 and sn-2 DAG lactones in binding to protein kinase C. J Med Chem43:3209-17 (2000) Protein kinase C alpha type
Name:Protein kinase C alpha type
Type:Enzyme
Mol. Mass.:76755.65
Organism:Homo sapiens (Human)
Description:The recombinant human PKC enzymes were produced using a baculovirus expression system in SF9 cells
Residue:672
BDBM50085904
NameBDBM50085904
Synonyms:3-Isopropyl-4-methyl-pentanoic acid 2-hydroxymethyl-4-(3-isopropyl-4-methyl-pentylidene)-5-oxo-tetrahydro-furan-2-ylmethyl ester CHEMBL290876
TypeSmall organic molecule
Emp. Form.C24H42O5
Mol. Mass.410.5873
SMILESCC(C)C(C\C=C1\CC(CO)(COC(=O)CC(C(C)C)C(C)C)OC1=O)C(C)C