Reaction Details
TargetHistamine H3 receptor
LigandBDBM50091376
Substrate/Competitorn/a
Meas. Tech.ChEMBL_86898 (CHEMBL698408)
Ki 4.4±n/a nM
Citation Sasse, ASadek, BLigneau, XElz, SPertz, HHLuger, PGanellin, CRArrang, JMSchwartz, JCSchunack, WStark, H New histamine H(3)-receptor ligands of the proxifan series: imoproxifan and other selective antagonists with high oral in vivo potency. J Med Chem43:3335-43 (2000) Histamine H3 receptor
Name:Histamine H3 receptor
Type:G Protein-Coupled Receptor (GPCR)
Mol. Mass.:48607.98
Organism:Rattus norvegicus (rat)
Description:n/a
Residue:445
BDBM50091376
NameBDBM50091376
Synonyms:CHEMBL116270 Cyclopropyl-{4-[3-(1H-imidazol-4-yl)-propoxy]-phenyl}-methanone oxime; compound with but-2-enedioic acid (0.25M H2O)
TypeSmall organic molecule
Emp. Form.C16H19N3O2
Mol. Mass.285.341
SMILESO=NC(C1CC1)c1ccc(OCCCc2cnc[nH]2)cc1