Reaction Details
TargetHistamine H3 receptor
LigandBDBM50091384
Substrate/Competitorn/a
Meas. Tech.ChEMBL_86898 (CHEMBL698408)
Ki 1.5±n/a nM
Citation Sasse, ASadek, BLigneau, XElz, SPertz, HHLuger, PGanellin, CRArrang, JMSchwartz, JCSchunack, WStark, H New histamine H(3)-receptor ligands of the proxifan series: imoproxifan and other selective antagonists with high oral in vivo potency. J Med Chem43:3335-43 (2000) Histamine H3 receptor
Name:Histamine H3 receptor
Type:G Protein-Coupled Receptor (GPCR)
Mol. Mass.:48607.98
Organism:Rattus norvegicus (rat)
Description:n/a
Residue:445
BDBM50091384
NameBDBM50091384
Synonyms:4-[3-(1H-Imidazol-4-yl)-propoxy]-benzoic acid hydrazide; compound with but-2-enedioic acid (0.5M H2O) | CHEMBL113404
TypeSmall organic molecule
Emp. Form.C13H16N4O2
Mol. Mass.260.2917
SMILESNNC(=O)c1ccc(OCCCc2cnc[nH]2)cc1