Reaction Details
TargetHistamine H3 receptor
LigandBDBM50091386
Substrate/Competitorn/a
Meas. Tech.ChEMBL_86898 (CHEMBL698408)
Ki 0.8±n/a nM
Citation Sasse, ASadek, BLigneau, XElz, SPertz, HHLuger, PGanellin, CRArrang, JMSchwartz, JCSchunack, WStark, H New histamine H(3)-receptor ligands of the proxifan series: imoproxifan and other selective antagonists with high oral in vivo potency. J Med Chem43:3335-43 (2000) Histamine H3 receptor
Name:Histamine H3 receptor
Type:G Protein-Coupled Receptor (GPCR)
Mol. Mass.:48607.98
Organism:Rattus norvegicus (rat)
Description:n/a
Residue:445
BDBM50091386
NameBDBM50091386
Synonyms:1-{4-[3-(1H-Imidazol-4-yl)-propoxy]-phenyl}-ethanone CHEMBL128851
TypeSmall organic molecule
Emp. Form.C14H16N2O2
Mol. Mass.244.289
SMILESCC(=O)c1ccc(OCCCc2cnc[nH]2)cc1