Reaction Details
TargetHistamine H3 receptor
LigandBDBM50091396
Substrate/Competitorn/a
Meas. Tech.ChEMBL_86898 (CHEMBL698408)
Ki 0.44±n/a nM
Citation Sasse, ASadek, BLigneau, XElz, SPertz, HHLuger, PGanellin, CRArrang, JMSchwartz, JCSchunack, WStark, H New histamine H(3)-receptor ligands of the proxifan series: imoproxifan and other selective antagonists with high oral in vivo potency. J Med Chem43:3335-43 (2000) Histamine H3 receptor
Name:Histamine H3 receptor
Type:G Protein-Coupled Receptor (GPCR)
Mol. Mass.:48607.98
Organism:Rattus norvegicus (rat)
Description:n/a
Residue:445
BDBM50091396
NameBDBM50091396
Synonyms:4-[3-(1H-Imidazol-4-yl)-propoxy]-benzaldehyde oxime; compound with but-2-enedioic acid (0.5M H2O) | CHEMBL326081
TypeSmall organic molecule
Emp. Form.C13H15N3O2
Mol. Mass.245.2771
SMILESO=NCc1ccc(OCCCc2cnc[nH]2)cc1