Reaction Details
TargetC-C chemokine receptor type 2
LigandBDBM50091446
Substrate/Competitorn/a
Meas. Tech.ChEBML_41896
Ki 2800±n/a nM
Citation Forbes, ITCooper, DGDodds, EKHickey, DMIfe, RJMeeson, MStockley, MBerkhout, TAGohil, JGroot, PHMoores, K CCR2B receptor antagonists: conversion of a weak HTS hit to a potent lead compound. Bioorg Med Chem Lett10:1803-6 (2000) C-C chemokine receptor type 2
Name:C-C chemokine receptor type 2
Type:Enzyme
Mol. Mass.:41932.32
Organism:Homo sapiens (Human)
Description:P41597
Residue:374
BDBM50091446
NameBDBM50091446
Synonyms:(E)-3-(4-Cyano-phenyl)-N-{5-[4-(1H-indol-3-yl)-piperidin-1-yl]-pentyl}-acrylamide CHEMBL53557
TypeSmall organic molecule
Emp. Form.C28H32N4O
Mol. Mass.440.5799
SMILESO=C(NCCCCCN1CCC(CC1)c1c[nH]c2ccccc12)\C=C\c1ccc(cc1)C#N