Reaction Details
TargetC-C chemokine receptor type 2
LigandBDBM50091460
Substrate/Competitorn/a
Meas. Tech.ChEBML_41896
Ki 560±n/a nM
Citation Forbes, ITCooper, DGDodds, EKHickey, DMIfe, RJMeeson, MStockley, MBerkhout, TAGohil, JGroot, PHMoores, K CCR2B receptor antagonists: conversion of a weak HTS hit to a potent lead compound. Bioorg Med Chem Lett10:1803-6 (2000) C-C chemokine receptor type 2
Name:C-C chemokine receptor type 2
Type:Enzyme
Mol. Mass.:41932.32
Organism:Homo sapiens (Human)
Description:P41597
Residue:374
BDBM50091460
NameBDBM50091460
Synonyms:(E)-3-(3-Chloro-phenyl)-N-{5-[4-(1H-indol-3-yl)-piperidin-1-yl]-pentyl}-acrylamide CHEMBL53476 | TCMDC-139211
TypeSmall organic molecule
Emp. Form.C27H32ClN3O
Mol. Mass.450.015
SMILESClc1cccc(\C=C\C(=O)NCCCCCN2CCC(CC2)c2c[nH]c3ccccc23)c1