Reaction Details
TargetC-C chemokine receptor type 2
LigandBDBM50091464
Substrate/Competitorn/a
Meas. Tech.ChEBML_41896
Ki 4400±n/a nM
Citation Forbes, ITCooper, DGDodds, EKHickey, DMIfe, RJMeeson, MStockley, MBerkhout, TAGohil, JGroot, PHMoores, K CCR2B receptor antagonists: conversion of a weak HTS hit to a potent lead compound. Bioorg Med Chem Lett10:1803-6 (2000) C-C chemokine receptor type 2
Name:C-C chemokine receptor type 2
Type:Enzyme
Mol. Mass.:41932.32
Organism:Homo sapiens (Human)
Description:P41597
Residue:374
BDBM50091464
NameBDBM50091464
Synonyms:2-(3,4-Dichloro-phenyl)-N-{5-[4-(1H-indol-3-yl)-piperidin-1-yl]-pentyl}-acetamide N-(5-(4-(1H-indol-3-yl)piperidin-1-yl)pentyl)-2-(3,4-dichlorophenyl)acetamide
TypeSmall organic molecule
Emp. Form.C26H31Cl2N3O
Mol. Mass.472.45
SMILESClc1ccc(CC(=O)NCCCCCN2CCC(CC2)c2c[nH]c3ccccc23)cc1Cl