Reaction Details
TargetC-C chemokine receptor type 2
LigandBDBM50091462
Substrate/Competitorn/a
Meas. Tech.ChEBML_41896
Ki>10000±n/a nM
Citation Forbes, ITCooper, DGDodds, EKHickey, DMIfe, RJMeeson, MStockley, MBerkhout, TAGohil, JGroot, PHMoores, K CCR2B receptor antagonists: conversion of a weak HTS hit to a potent lead compound. Bioorg Med Chem Lett10:1803-6 (2000) C-C chemokine receptor type 2
Name:C-C chemokine receptor type 2
Type:Enzyme
Mol. Mass.:41932.32
Organism:Homo sapiens (Human)
Description:P41597
Residue:374
BDBM50091462
NameBDBM50091462
Synonyms:(E)-3-(3,4-Dichloro-phenyl)-N-{2-[4-(1H-indol-3-yl)-piperidin-1-yl]-ethyl}-acrylamide | CHEMBL52435
TypeSmall organic molecule
Emp. Form.C24H25Cl2N3O
Mol. Mass.442.381
SMILESClc1ccc(\C=C\C(=O)NCCN2CCC(CC2)c2c[nH]c3ccccc23)cc1Cl