Reaction Details
TargetC-C chemokine receptor type 2
LigandBDBM50091471
Substrate/Competitorn/a
Meas. Tech.ChEBML_41896
Ki 550±n/a nM
Citation Forbes, ITCooper, DGDodds, EKHickey, DMIfe, RJMeeson, MStockley, MBerkhout, TAGohil, JGroot, PHMoores, K CCR2B receptor antagonists: conversion of a weak HTS hit to a potent lead compound. Bioorg Med Chem Lett10:1803-6 (2000) C-C chemokine receptor type 2
Name:C-C chemokine receptor type 2
Type:Enzyme
Mol. Mass.:41932.32
Organism:Homo sapiens (Human)
Description:P41597
Residue:374
BDBM50091471
NameBDBM50091471
Synonyms:(E)-N-(5-(4-(1H-indol-3-yl)piperidin-1-yl)pentyl)-3-p-tolylacrylamide CHEMBL50025 | TCMDC-139236
TypeSmall organic molecule
Emp. Form.C28H35N3O
Mol. Mass.429.597
SMILESCc1ccc(\C=C\C(=O)NCCCCCN2CCC(CC2)c2c[nH]c3ccccc23)cc1