Reaction Details
TargetProstaglandin F2-alpha receptor
LigandBDBM50035622
Substrate/Competitorn/a
Meas. Tech.ChEMBL_158459 (CHEMBL763263)
Ki 119±n/a nM
Citation Klimko, PGDavis, TLGriffin, BWSharif, NA Synthesis and biological activity of a novel 11a-homo (cyclohexyl) prostaglandin. J Med Chem43:3400-7 (2000) Prostaglandin F2-alpha receptor
Name:Prostaglandin F2-alpha receptor
Type:Enzyme
Mol. Mass.:40072.29
Organism:Homo sapiens (Human)
Description:P43088
Residue:359
BDBM50035622
NameBDBM50035622
Synonyms:(5Z,13E,15S)-9alpha,11alpha,15-trihydroxyprosta-5,13-dien-1-oic acid DINOPROST l-PGF2-alpha prostaglandin F2alpha
TypeSmall organic molecule
Emp. Form.C20H34O5
Mol. Mass.354.481
SMILESCCCCC[C@H](O)\C=C\[C@H]1[C@H](O)C[C@H](O)[C@@H]1C\C=C/CCCC(O)=O