Reaction Details
TargetGlutamate receptor ionotropic, NMDA 1
LigandBDBM50091635
Substrate/Competitorn/a
Meas. Tech.ChEMBL_140482 (CHEMBL747072)
IC50 6.1±n/a nM
Citation Wright, JLGregory, TFKesten, SRBoxer, PASerpa, KAMeltzer, LTWise, LDEspitia, SAKonkoy, CSWhittemore, ERWoodward, RM Subtype-selective N-methyl-D-aspartate receptor antagonists: synthesis and biological evaluation of 1-(heteroarylalkynyl)-4-benzylpiperidines. J Med Chem43:3408-19 (2000) Glutamate receptor ionotropic, NMDA 1
Name:Glutamate receptor ionotropic, NMDA 1
Type:Enzyme Catalytic Domain
Mol. Mass.:105397.81
Organism:Homo sapiens (Human)
Description:Q05586
Residue:938
BDBM50091635
NameBDBM50091635
Synonyms:5-{3-[4-(3-Fluoro-benzyl)-piperidin-1-yl]-prop-1-ynyl}-1,3-dihydro-benzoimidazol-2-one | CHEMBL19636
TypeSmall organic molecule
Emp. Form.C22H22FN3O
Mol. Mass.363.428
SMILESFc1cccc(CC2CCN(CC#Cc3ccc4[nH]c(=O)[nH]c4c3)CC2)c1