Reaction Details
TargetNeuropeptide Y receptor type 2
LigandBDBM50091669
Substrate/Competitorn/a
Meas. Tech.ChEMBL_154174 (CHEMBL762378)
IC50 0.36±n/a nM
Citation Balasubramaniam, ATao, ZZhai, WStein, MSheriff, SChance, WTFischer, JEEden, PETaylor, JELiu, CDMcFadden, DWVoisin, TRoze, CLaburthe, M Structure-activity studies including a Psi(CH(2)-NH) scan of peptide YY (PYY) active site, PYY(22-36), for interaction with rat intestinal PYY receptors: development of analogues with potent in vivo activity in the intestine. J Med Chem43:3420-7 (2000) Neuropeptide Y receptor type 2
Name:Neuropeptide Y receptor type 2
Type:Enzyme Catalytic Domain
Mol. Mass.:42514.44
Organism:RAT
Description:NPY-Y2 NPY2R RAT::Q9ERC0
Residue:381
BDBM50091669
NameBDBM50091669
Synonyms:CHEMBL438923 | N-alpha-Ac-[CH2-NH28-29]PYY(22-36)-NH2(N-alpha-Ac-ASLAHYL-CH2-NH-NLVTRQRY-NH2)
TypeSmall organic molecule
Emp. Form.C86H141N29O21
Mol. Mass.1917.2214
SMILESCC(C)C[C@@H](CN[C@@H](CC(N)=O)C(=O)N[C@@H](CC(C)C)C(=O)N[C@@H](C(C)C)C(=O)N[C@@H]([C@@H](C)O)C(=O)N[C@@H](CCCNC(N)=N)C(=O)N[C@@H](CCC(N)=O)C(=O)N[C@@H](CCCNC(N)=N)C(=O)N[C@@H](Cc1ccc(O)cc1)C(N)=O)NC(=O)[C@H](Cc1ccc(O)cc1)NC(=O)[C@H](Cc1cnc[nH]1)NC(=O)[C@H](CCCNC(N)=N)NC(=O)[C@H](CC(C)C)NC(=O)[C@H](CO)NC(=O)[C@H](C)NC(C)=O