Reaction Details
Target3-oxo-5-alpha-steroid 4-dehydrogenase 1
LigandBDBM50044879
Substrate/Competitorn/a
Meas. Tech.ChEMBL_205056 (CHEMBL810250)
IC50 17±n/a nM
Citation Abell, ADPrince, MJMcNulty, AMNeubauer, BL Simple bi- and tricyclic inhibitors of human steroid 5alpha-reductase. Bioorg Med Chem Lett10:1909-11 (2001) 3-oxo-5-alpha-steroid 4-dehydrogenase 1
Name:3-oxo-5-alpha-steroid 4-dehydrogenase 1
Type:Enzyme
Mol. Mass.:29472.80
Organism:Homo sapiens (Human)
Description:P18405
Residue:259
BDBM50044879
NameBDBM50044879
Synonyms:(4aR,10bR)-8-Chloro-4,10b-dimethyl-1,4,4a,5,6,10b-hexahydro-2H-benzo[f]quinolin-3-one CHEMBL29166 | LY-266111
TypeSmall organic molecule
Emp. Form.C15H18ClNO
Mol. Mass.263.763
SMILESCN1[C@@H]2CCc3cc(Cl)ccc3[C@@]2(C)CCC1=O