Reaction Details
TargetIntegrin alpha-IIb/beta-3
LigandBDBM50091745
Substrate/Competitorn/a
Meas. Tech.ChEMBL_218219 (CHEMBL821404)
Kd 2.2±n/a nM
Citation Egbertson, MSBednar, BAskew, BCBednar, RABrashear, KBreslin, MJDuggan, MEFisher, TEHalczenko, WHutchinson, JHIhle, NPrugh, JDWai, JSGould, RJHartman, GD Nonpeptide GPIIB/IIIA receptor antagonists. Part 21: C-6 flexibility and amide bond orientation are important factors in determining the affinity of compounds for activated or resting platelet receptors. Bioorg Med Chem Lett10:1943-8 (2001) Integrin alpha-IIb/beta-3
Name:Integrin alpha-IIb/beta-3
Synonyms:Glycoprotein IIb/IIIa
Type:n/a
Mol. Mass.:n/a
Description:ASSAY_ID of EBI is 30109
Components:This complex has 2 components.
Component 1
Name:Integrin beta-3
Type:Protein
Mol. Mass.:87038.91
Organism:Homo sapiens (Human)
Description:P05106
Residue:788
Component 2
Name:Integrin alpha-IIb
Synonyms:CD_antigen=CD41 GPIIb Glycoprotein IIb ITGA2B Integrin alpha-IIb heavy chain Integrin alpha-IIb light chain, form 2 Integrin alpha-V/beta-3 and alpha-IIb/beta 3 | Platelet membrane glycoprotein IIb
Type:Protein
Mol. Mass.:113354.85
Organism:Homo sapiens (Human)
Description:P08514
Residue:1039
BDBM50091745
NameBDBM50091745
Synonyms:(S)-3-({2-[2-(2-Amino-pyridin-4-yl)-ethyl]-3-oxo-2,3-dihydro-1H-isoindole-5-carbonyl}-amino)-pent-4-ynoic acid | CHEMBL59020
TypeSmall organic molecule
Emp. Form.C21H20N4O4
Mol. Mass.392.4079
SMILESNc1cc(CCN2Cc3ccc(cc3C2=O)C(=O)N[C@@H](CC(O)=O)C#C)ccn1