Reaction Details
TargetIntegrin alpha-IIb/beta-3
LigandBDBM50058239
Substrate/Competitorn/a
Meas. Tech.ChEMBL_218219 (CHEMBL821404)
Kd 0.080000±n/a nM
Citation Egbertson, MSBednar, BAskew, BCBednar, RABrashear, KBreslin, MJDuggan, MEFisher, TEHalczenko, WHutchinson, JHIhle, NPrugh, JDWai, JSGould, RJHartman, GD Nonpeptide GPIIB/IIIA receptor antagonists. Part 21: C-6 flexibility and amide bond orientation are important factors in determining the affinity of compounds for activated or resting platelet receptors. Bioorg Med Chem Lett10:1943-8 (2001) Integrin alpha-IIb/beta-3
Name:Integrin alpha-IIb/beta-3
Synonyms:Glycoprotein IIb/IIIa
Type:n/a
Mol. Mass.:n/a
Description:ASSAY_ID of EBI is 30109
Components:This complex has 2 components.
Component 1
Name:Integrin beta-3
Type:Protein
Mol. Mass.:87038.91
Organism:Homo sapiens (Human)
Description:P05106
Residue:788
Component 2
Name:Integrin alpha-IIb
Synonyms:CD_antigen=CD41 GPIIb Glycoprotein IIb ITGA2B Integrin alpha-IIb heavy chain Integrin alpha-IIb light chain, form 2 Integrin alpha-V/beta-3 and alpha-IIb/beta 3 | Platelet membrane glycoprotein IIb
Type:Protein
Mol. Mass.:113354.85
Organism:Homo sapiens (Human)
Description:P08514
Residue:1039
BDBM50058239
NameBDBM50058239
Synonyms:(S)-3-{[4-Oxo-5-(2-piperidin-4-yl-ethyl)-5,6,7,8-tetrahydro-4H-1,5,8a-triaza-azulene-2-carbonyl]-amino}-2-(toluene-4-sulfonylamino)-propionic acid CHEMBL298655 | L-738167
TypeSmall organic molecule
Emp. Form.C25H34N6O6S
Mol. Mass.546.639
SMILESCc1ccc(cc1)S(=O)(=O)N[C@@H](CNC(=O)c1cc2C(=O)N(CCC3CCNCC3)CCCn2n1)C(O)=O