Reaction Details
TargetAtrial natriuretic peptide receptor 3
LigandBDBM50091751
Substrate/Competitorn/a
Meas. Tech.ChEBML_34991
Ki 0.100000±n/a nM
Citation Veale, CAAlford, VCAharony, DBanville, DLBialecki, RABrown, FJDamewood, JRDantzman, CLEdwards, PDJacobs, RTMauger, RCMurphy, MMPalmer, WPine, KKRumsey, WLGarcia-Davenport, LEShaw, ASteelman, GBSurian, JMVacek, EP The discovery of non-basic atrial natriuretic peptide clearance receptor antagonists. Part 1. Bioorg Med Chem Lett10:1949-52 (2001) Atrial natriuretic peptide receptor 3
Name:Atrial natriuretic peptide receptor 3
Type:PROTEIN
Mol. Mass.:59805.12
Organism:Homo sapiens (Human)
Description:ChEMBL_34991
Residue:541
BDBM50091751
NameBDBM50091751
Synonyms:CHEMBL411542 | Cyclic-(Cys-Phe-Gly-Gly-Arg-Ile-Asp-Arg-Ile-Gly-Ala-Gln-Ser-Gly-Leu-Gly-Cys)
TypeSmall organic molecule
Emp. Form.C70H114N24O22S2
Mol. Mass.1707.932
SMILESCC[C@H](C)[C@@H]1NC(=O)[C@H](CCCNC(N)=N)NC(=O)[C@H](CC(O)=O)NC(=O)[C@@H](NC(=O)[C@H](CCCNC(N)=N)NC(=O)CNC(=O)CNC(=O)[C@H](Cc2ccccc2)NC(=O)[C@H](N)CSSC[C@@H](NC(=O)CNC(=O)[C@H](CC(C)C)NC(=O)CNC(=O)[C@H](CO)NC(=O)[C@H](CCC(N)=O)NC(=O)[C@H](C)NC(=O)CNC1=O)C(O)=O)[C@@H](C)CC