Reaction Details
Target5-hydroxytryptamine receptor 2C
LigandBDBM50091825
Substrate/Competitorn/a
Meas. Tech.ChEMBL_2718 (CHEMBL617278)
Ki 1±n/a nM
Citation Welmaker, GSNelson, JASabalski, JESabb, ALPotoski, JRGraziano, DKagan, MCoupet, JDunlop, JMazandarani, HRosenzweig-Lipson, SSukoff, SZhang, Y Synthesis and 5-hydroxytryptamine (5-HT) activity of 2,3,4,4a-tetrahydro-1H-pyrazino[1,2-a]quinoxalin-5-(6H)ones and 2,3,4,4a,5,6-hexahydro-1H-pyrazino[1,2-a]quinoxalines. Bioorg Med Chem Lett10:1991-4 (2001) 5-hydroxytryptamine receptor 2C
Name:5-hydroxytryptamine receptor 2C
Type:G Protein-Coupled Receptor (GPCR)
Mol. Mass.:51836.79
Organism:Homo sapiens (Human)
Description:P28335
Residue:458
BDBM50091825
NameBDBM50091825
Synonyms:8,9-Dichloro-2,3,4,4a,5,6-hexahydro-1H-pyrazino[1,2-a]quinoxaline | CHEMBL58009
TypeSmall organic molecule
Emp. Form.C11H13Cl2N3
Mol. Mass.258.147
SMILESClc1cc2NCC3CNCCN3c2cc1Cl