Reaction Details
Target5-hydroxytryptamine receptor 2C
LigandBDBM50091833
Substrate/Competitorn/a
Meas. Tech.ChEMBL_2718 (CHEMBL617278)
Ki 91±n/a nM
Citation Welmaker, GSNelson, JASabalski, JESabb, ALPotoski, JRGraziano, DKagan, MCoupet, JDunlop, JMazandarani, HRosenzweig-Lipson, SSukoff, SZhang, Y Synthesis and 5-hydroxytryptamine (5-HT) activity of 2,3,4,4a-tetrahydro-1H-pyrazino[1,2-a]quinoxalin-5-(6H)ones and 2,3,4,4a,5,6-hexahydro-1H-pyrazino[1,2-a]quinoxalines. Bioorg Med Chem Lett10:1991-4 (2001) 5-hydroxytryptamine receptor 2C
Name:5-hydroxytryptamine receptor 2C
Type:G Protein-Coupled Receptor (GPCR)
Mol. Mass.:51836.79
Organism:Homo sapiens (Human)
Description:P28335
Residue:458
BDBM50091833
NameBDBM50091833
Synonyms:8,9-Difluoro-2,3,4,4a-tetrahydro-1H,6H-pyrazino[1,2-a]quinoxalin-5-one | CHEMBL59807
TypeSmall organic molecule
Emp. Form.C11H11F2N3O
Mol. Mass.239.2213
SMILESFc1cc2NC(=O)C3CNCCN3c2cc1F