Reaction Details
TargetEndothelin-converting enzyme 1
LigandBDBM50091878
Substrate/Competitorn/a
Meas. Tech.ChEBML_64202
IC50 11±n/a nM
Citation Fink, CAMoskal, MFirooznia, FHoyer, DSymonsbergen, DWei, DQiao, YSavage, PBeil, METrapani, AJJeng, AY Design and synthesis of potent thiol-based inhibitors of endothelin converting enzyme-1. Bioorg Med Chem Lett10:2037-9 (2001) Endothelin-converting enzyme 1
Name:Endothelin-converting enzyme 1
Type:Enzyme
Mol. Mass.:87155.11
Organism:Homo sapiens (Human)
Description:P42892
Residue:770
BDBM50091878
NameBDBM50091878
Synonyms:(S)-3-Biphenyl-4-yl-2-{[1-((S)-2-mercapto-3-methoxy-propionylamino)-cyclopentanecarbonyl]-amino}-propionic acid | CHEMBL293024
TypeSmall organic molecule
Emp. Form.C25H30N2O5S
Mol. Mass.470.581
SMILESCOC[C@H](S)C(=O)NC1(CCCC1)C(=O)N[C@@H](Cc1ccc(cc1)-c1ccccc1)C(O)=O