Reaction Details
TargetD(4) dopamine receptor
LigandBDBM50092046
Substrate/Competitorn/a
Meas. Tech.ChEBML_60689
Ki 4±n/a nM
Citation Zhao, HThurkauf, ABraun, JBrodbeck, RKieltyka, A Design, synthesis, and discovery of 3-piperazinyl-3,4-dihydro-2(1H)-quinolinone derivatives: a novel series of mixed dopamine D2/D4 receptor antagonists. Bioorg Med Chem Lett10:2119-22 (2000) D(4) dopamine receptor
Name:D(4) dopamine receptor
Type:Enzyme
Mol. Mass.:48373.19
Organism:Homo sapiens (Human)
Description:P21917
Residue:419
BDBM50092046
NameBDBM50092046
Synonyms:3-[4-(4-Chloro-benzyl)-piperazin-1-yl]-1-ethyl-3,4-dihydro-1H-quinolin-2-one | CHEMBL68191
TypeSmall organic molecule
Emp. Form.C22H26ClN3O
Mol. Mass.383.914
SMILESCCN1C(=O)C(Cc2ccccc12)N1CCN(Cc2ccc(Cl)cc2)CC1