Reaction Details
TargetD(2) dopamine receptor
LigandBDBM50092051
Substrate/Competitorn/a
Meas. Tech.ChEBML_60226
Ki 133±n/a nM
Citation Zhao, HThurkauf, ABraun, JBrodbeck, RKieltyka, A Design, synthesis, and discovery of 3-piperazinyl-3,4-dihydro-2(1H)-quinolinone derivatives: a novel series of mixed dopamine D2/D4 receptor antagonists. Bioorg Med Chem Lett10:2119-22 (2000) D(2) dopamine receptor
Name:D(2) dopamine receptor
Type:Cell-surface receptors
Mol. Mass.:50647.10
Organism:Homo sapiens (Human)
Description:P14416
Residue:443
BDBM50092051
NameBDBM50092051
Synonyms:3-[4-(4-Chloro-benzyl)-piperazin-1-yl]-1-methyl-3,4-dihydro-1H-quinolin-2-one | CHEMBL305276
TypeSmall organic molecule
Emp. Form.C21H24ClN3O
Mol. Mass.369.888
SMILESCN1C(=O)C(Cc2ccccc12)N1CCN(Cc2ccc(Cl)cc2)CC1