Reaction Details
TargetD(4) dopamine receptor
LigandBDBM50092037
Substrate/Competitorn/a
Meas. Tech.ChEBML_60689
Ki 2469±n/a nM
Citation Zhao, HThurkauf, ABraun, JBrodbeck, RKieltyka, A Design, synthesis, and discovery of 3-piperazinyl-3,4-dihydro-2(1H)-quinolinone derivatives: a novel series of mixed dopamine D2/D4 receptor antagonists. Bioorg Med Chem Lett10:2119-22 (2000) D(4) dopamine receptor
Name:D(4) dopamine receptor
Type:Enzyme
Mol. Mass.:48373.19
Organism:Homo sapiens (Human)
Description:P21917
Residue:419
BDBM50092037
NameBDBM50092037
Synonyms:3-[4-(4-Chloro-benzyl)-piperazin-1-yl]-1-methyl-1,3,4,5-tetrahydro-benzo[b]azepin-2-one | CHEMBL63209
TypeSmall organic molecule
Emp. Form.C22H26ClN3O
Mol. Mass.383.914
SMILESCN1c2ccccc2CCC(N2CCN(Cc3ccc(Cl)cc3)CC2)C1=O