Reaction Details
TargetD(4) dopamine receptor
LigandBDBM50092042
Substrate/Competitorn/a
Meas. Tech.ChEBML_60689
Ki 100±n/a nM
Citation Zhao, HThurkauf, ABraun, JBrodbeck, RKieltyka, A Design, synthesis, and discovery of 3-piperazinyl-3,4-dihydro-2(1H)-quinolinone derivatives: a novel series of mixed dopamine D2/D4 receptor antagonists. Bioorg Med Chem Lett10:2119-22 (2000) D(4) dopamine receptor
Name:D(4) dopamine receptor
Type:Enzyme
Mol. Mass.:48373.19
Organism:Homo sapiens (Human)
Description:P21917
Residue:419
BDBM50092042
NameBDBM50092042
Synonyms:3-[4-(4-Chloro-benzyl)-piperazin-1-yl]-3,4-dihydro-1H-quinolin-2-one | CHEMBL67222
TypeSmall organic molecule
Emp. Form.C20H22ClN3O
Mol. Mass.355.861
SMILESClc1ccc(CN2CCN(CC2)C2Cc3ccccc3NC2=O)cc1