Reaction Details
TargetInsulin receptor
LigandBDBM50092148
Substrate/Competitorn/a
Meas. Tech.ChEMBL_88875 (CHEMBL698212)
EC50 1000±n/a nM
Citation Liu, KXu, LSzalkowski, DLi, ZDing, VKwei, GHuskey, SMoller, DEHeck, JVZhang, BBJones, AB Discovery of a potent, highly selective, and orally efficacious small-molecule activator of the insulin receptor. J Med Chem43:3487-94 (2000) Insulin receptor
Name:Insulin receptor
Type:Receptor Tyrosine Kinase
Mol. Mass.:156322.60
Organism:Homo sapiens (Human)
Description:P06213
Residue:1382
BDBM50092148
NameBDBM50092148
Synonyms:2-Benzo[b]thiophen-3-yl-3,6-dihydroxy-5-phenyl-[1,4]benzoquinone | CHEMBL117440
TypeSmall organic molecule
Emp. Form.C20H12O4S
Mol. Mass.348.372
SMILESO=C1C(c2csc3ccccc23)C(=O)C(=O)C(C1=O)c1ccccc1