Reaction Details
TargetInsulin receptor
LigandBDBM50092147
Substrate/Competitorn/a
Meas. Tech.ChEMBL_88875 (CHEMBL698212)
EC50 6000±n/a nM
Citation Liu, KXu, LSzalkowski, DLi, ZDing, VKwei, GHuskey, SMoller, DEHeck, JVZhang, BBJones, AB Discovery of a potent, highly selective, and orally efficacious small-molecule activator of the insulin receptor. J Med Chem43:3487-94 (2000) Insulin receptor
Name:Insulin receptor
Type:Receptor Tyrosine Kinase
Mol. Mass.:156322.60
Organism:Homo sapiens (Human)
Description:P06213
Residue:1382
BDBM50092147
NameBDBM50092147
Synonyms:2,5-Dihydroxy-3-naphthalen-1-yl-6-phenyl-[1,4]benzoquinone | CHEMBL432971
TypeSmall organic molecule
Emp. Form.C22H14O4
Mol. Mass.342.3442
SMILESO=C1C(C(=O)C(=O)C(C1=O)c1cccc2ccccc12)c1ccccc1