Reaction Details
TargetMuscarinic acetylcholine receptor M4
LigandBDBM50092313
Substrate/Competitorn/a
Meas. Tech.ChEBML_139127
Ki 0.070000±n/a nM
Citation Billard, WBinch, HBratzler, KChen, LYCrosby, GDuffy, RADugar, SLachowicz, JMcQuade, RPushpavanam, PRuperto, VBTaylor, LAClader, JW Diphenylsulfone muscarinic antagonists: piperidine derivatives with high M2 selectivity and improved potency. Bioorg Med Chem Lett10:2209-12 (2001) Muscarinic acetylcholine receptor M4
Name:Muscarinic acetylcholine receptor M4
Type:Enzyme Catalytic Domain
Mol. Mass.:53079.31
Organism:Homo sapiens (Human)
Description:Cholinergic, muscarinic M4 CHRM4 HUMAN M3::P08173
Residue:479
BDBM50092313
NameBDBM50092313
Synonyms:1-Cyclohexyl-4-{1-[4-(4-methoxy-benzenesulfinyl)-phenyl]-ethyl}-piperidine | CHEMBL71124
TypeSmall organic molecule
Emp. Form.C26H35NO2S
Mol. Mass.425.627
SMILESCOc1ccc(cc1)S(=O)c1ccc(cc1)C(C)C1CCN(CC1)C1CCCCC1