Reaction Details
TargetGastrin/cholecystokinin type B receptor
LigandBDBM50002477
Substrate/Competitorn/a
Meas. Tech.ChEMBL_48605 (CHEMBL659586)
Ki 9.4±n/a nM
Citation Bellier, BMillion, MEDaNascimento, SMeudal, HKellou, SMaigret, BGarbay, C Replacement of glycine with dicarbonyl and related moieties in analogues of the C-terminal pentapeptide of cholecystokinin: CCK(2) agonists displaying a novel binding mode. J Med Chem43:3614-23 (2000) Gastrin/cholecystokinin type B receptor
Name:Gastrin/cholecystokinin type B receptor
Type:Enzyme Catalytic Domain
Mol. Mass.:48980.43
Organism:RAT
Description:Cholecystokinin A CCKBR RAT::P30553
Residue:452
BDBM50002477
NameBDBM50002477
Synonyms:(S)-3-{(S)-2-[(S)-2-tert-Butoxycarbonylamino-3-(1H-indol-3-yl)-propionylamino]-4-methylsulfanyl-butyrylamino}-N-((S)-1-carbamoyl-2-phenyl-ethyl)-succinamic acid 3-{2-[2-tert-Butoxycarbonylamino-3-(1H-indol-3-yl)-propionylamino]-4-methylsulfanyl-butyrylamino}-N-(1-carbamoyl-2-phenyl-ethyl)-succinamic acid CHEMBL64605
TypeSmall organic molecule
Emp. Form.C34H44N6O8S
Mol. Mass.696.814
SMILESCSCC[C@H](NC(=O)[C@H](Cc1c[nH]c2ccccc12)NC(=O)OC(C)(C)C)C(=O)N[C@@H](CC(O)=O)C(=O)N[C@@H](Cc1ccccc1)C(N)=O