Reaction Details
TargetGastrin/cholecystokinin type B receptor
LigandBDBM50092384
Substrate/Competitorn/a
Meas. Tech.ChEMBL_48099 (CHEMBL663086)
Ki>3000±n/a nM
Citation Bellier, BMillion, MEDaNascimento, SMeudal, HKellou, SMaigret, BGarbay, C Replacement of glycine with dicarbonyl and related moieties in analogues of the C-terminal pentapeptide of cholecystokinin: CCK(2) agonists displaying a novel binding mode. J Med Chem43:3614-23 (2000) Gastrin/cholecystokinin type B receptor
Name:Gastrin/cholecystokinin type B receptor
Type:G Protein-Coupled Receptor (GPCR)
Mol. Mass.:48445.79
Organism:Homo sapiens (Human)
Description:Stable expression of human CCK-2 receptors in HEK 293 cells.
Residue:447
BDBM50092384
NameBDBM50092384
Synonyms:CHEMBL100538 | N-(1-Carbamoyl-2-phenyl-ethyl)-3-(2-{[2-(3-carboxy-propionylamino)-3-(1H-indol-3-yl)-propionyl]-methyl-amino}-hexanoylamino)-succinamic acid
TypeSmall organic molecule
Emp. Form.C35H44N6O9
Mol. Mass.692.7587
SMILESCCCC[C@H](N(C)C(=O)[C@H](Cc1c[nH]c2ccccc12)NC(=O)CCC(O)=O)C(=O)N[C@@H](CC(O)=O)C(=O)N[C@@H](Cc1ccccc1)C(N)=O