Reaction Details
TargetGastrin/cholecystokinin type B receptor
LigandBDBM50092401
Substrate/Competitorn/a
Meas. Tech.ChEMBL_48099 (CHEMBL663086)
Ki 15±n/a nM
Citation Bellier, BMillion, MEDaNascimento, SMeudal, HKellou, SMaigret, BGarbay, C Replacement of glycine with dicarbonyl and related moieties in analogues of the C-terminal pentapeptide of cholecystokinin: CCK(2) agonists displaying a novel binding mode. J Med Chem43:3614-23 (2000) Gastrin/cholecystokinin type B receptor
Name:Gastrin/cholecystokinin type B receptor
Type:G Protein-Coupled Receptor (GPCR)
Mol. Mass.:48445.79
Organism:Homo sapiens (Human)
Description:Stable expression of human CCK-2 receptors in HEK 293 cells.
Residue:447
BDBM50092401
NameBDBM50092401
Synonyms:CHEMBL177799 | N-(1-Carbamoyl-2-phenyl-ethyl)-3-{[2-(1H-indol-3-ylmethyl)-2-methyl-3,13-dioxo-1,4diaza-cyclotridecane-5-carbonyl]-amino}-succinamic acid
TypeSmall organic molecule
Emp. Form.C35H44N6O7
Mol. Mass.660.7599
SMILESC[C@@]1(Cc2c[nH]c3ccccc23)NC(=O)CCCCCCC[C@H](NC1=O)C(=O)N[C@@H](CC(O)=O)C(=O)N[C@@H](Cc1ccccc1)C(N)=O