Reaction Details
TargetGastrin/cholecystokinin type B receptor
LigandBDBM50092393
Substrate/Competitorn/a
Meas. Tech.ChEMBL_48439 (CHEMBL660367)
EC50 3.4±n/a nM
Citation Bellier, BMillion, MEDaNascimento, SMeudal, HKellou, SMaigret, BGarbay, C Replacement of glycine with dicarbonyl and related moieties in analogues of the C-terminal pentapeptide of cholecystokinin: CCK(2) agonists displaying a novel binding mode. J Med Chem43:3614-23 (2000) Gastrin/cholecystokinin type B receptor
Name:Gastrin/cholecystokinin type B receptor
Type:Enzyme Catalytic Domain
Mol. Mass.:48980.43
Organism:RAT
Description:Cholecystokinin A CCKBR RAT::P30553
Residue:452
BDBM50092393
NameBDBM50092393
Synonyms:3-(2-{[2-(2-{2-[2-tert-Butoxycarbonylamino-3-(4-sulfooxy-phenyl)-propionylamino]-hexanoylamino}-acetylamino)-3-(1H-indol-3-yl)-propionyl]-methyl-amino}-hexanoylamino)-N-(1-carbamoyl-2-phenyl-ethyl)-succinamic acid | CHEMBL411271
TypeSmall organic molecule
Emp. Form.C53H71N9O15S
Mol. Mass.1106.247
SMILESCCCC[C@H](NC(=O)[C@H](Cc1ccc(OS(O)(=O)=O)cc1)NC(=O)OC(C)(C)C)C(=O)NCC(=O)N[C@@H](Cc1c[nH]c2ccccc12)C(=O)N(C)[C@@H](CCCC)C(=O)N[C@@H](CC(O)=O)C(=O)N[C@@H](Cc1ccccc1)C(N)=O