Reaction Details
TargetD(2) dopamine receptor
LigandBDBM50092439
Substrate/Competitorn/a
Meas. Tech.ChEMBL_61577 (CHEMBL675091)
IC50 28±n/a nM
Citation Mayer, PBrunel, PChaplain, CPiedecoq, CCalmel, FSchambel, PChopin, PWurch, TPauwels, PJMarien, MVidaluc, JLImbert, T New substituted 1-(2,3-dihydrobenzo[1, 4]dioxin-2-ylmethyl)piperidin-4-yl derivatives with alpha(2)-adrenoceptor antagonist activity. J Med Chem43:3653-64 (2000) D(2) dopamine receptor
Name:D(2) dopamine receptor
Type:G Protein-Coupled Receptor (GPCR)
Mol. Mass.:50931.60
Organism:Rattus norvegicus (rat)
Description:P61169
Residue:444
BDBM50092439
NameBDBM50092439
Synonyms:3-{2-[1-(2,3-Dihydro-benzo[1,4]dioxin-2-ylmethyl)-piperidin-4-yl]-ethyl}-1,3,4,5-tetrahydro-benzo[d][1,3]diazepin-2-one | CHEMBL120836
TypeSmall organic molecule
Emp. Form.C25H31N3O3
Mol. Mass.421.5319
SMILESO=C1Nc2ccccc2CCN1CCC1CCN(CC2COc3ccccc3O2)CC1