Reaction Details
TargetD(2) dopamine receptor
LigandBDBM50092438
Substrate/Competitorn/a
Meas. Tech.ChEMBL_61577 (CHEMBL675091)
IC50 30±n/a nM
Citation Mayer, PBrunel, PChaplain, CPiedecoq, CCalmel, FSchambel, PChopin, PWurch, TPauwels, PJMarien, MVidaluc, JLImbert, T New substituted 1-(2,3-dihydrobenzo[1, 4]dioxin-2-ylmethyl)piperidin-4-yl derivatives with alpha(2)-adrenoceptor antagonist activity. J Med Chem43:3653-64 (2000) D(2) dopamine receptor
Name:D(2) dopamine receptor
Type:G Protein-Coupled Receptor (GPCR)
Mol. Mass.:50931.60
Organism:Rattus norvegicus (rat)
Description:P61169
Residue:444
BDBM50092438
NameBDBM50092438
Synonyms:CHEMBL123434 | N-{2-[1-(2,3-Dihydro-benzo[1,4]dioxin-2-ylmethyl)-piperidin-4-yl]-ethyl}-4-methyl-benzenesulfonamide
TypeSmall organic molecule
Emp. Form.C23H30N2O4S
Mol. Mass.430.56
SMILESCc1ccc(cc1)S(=O)(=O)NCCC1CCN(CC2COc3ccccc3O2)CC1