Reaction Details
TargetKappa-type opioid receptor
LigandBDBM50092514
Substrate/Competitorn/a
Meas. Tech.ChEMBL_145388 (CHEMBL750078)
Ki 820.0±n/a nM
Citation Siener, TCambareri, AKuhl, UEnglberger, WHaurand, MKögel, BHolzgrabe, U Synthesis and opioid receptor affinity of a series of 2, 4-diaryl-substituted 3,7-diazabicylononanones. J Med Chem43:3746-51 (2000) Kappa-type opioid receptor
Name:Kappa-type opioid receptor
Type:G Protein-Coupled Receptor (GPCR)
Mol. Mass.:42648.76
Organism:Homo sapiens (Human)
Description:P41145
Residue:380
BDBM50092514
NameBDBM50092514
Synonyms:3-{[(Methoxycarbonyl-m-tolyl-methyl)-methyl-amino]-m-tolyl-methyl}-1-methyl-4-oxo-piperidine-3-carboxylic acid methyl ester | CHEMBL179350
TypeSmall organic molecule
Emp. Form.C27H32N2O5
Mol. Mass.464.5534
SMILESCOC(=O)C12CN(C)CC(C(N(C)C1c1cccc(C)c1)c1cccc(C)c1)(C(=O)OC)C2=O