Reaction Details
TargetKappa-type opioid receptor
LigandBDBM50092515
Substrate/Competitorn/a
Meas. Tech.ChEMBL_145387 (CHEMBL750077)
Ki 20±n/a nM
Citation Siener, TCambareri, AKuhl, UEnglberger, WHaurand, MKögel, BHolzgrabe, U Synthesis and opioid receptor affinity of a series of 2, 4-diaryl-substituted 3,7-diazabicylononanones. J Med Chem43:3746-51 (2000) Kappa-type opioid receptor
Name:Kappa-type opioid receptor
Type:G Protein-Coupled Receptor (GPCR)
Mol. Mass.:42648.76
Organism:Homo sapiens (Human)
Description:P41145
Residue:380
BDBM50092515
NameBDBM50092515
Synonyms:3-((3-Hydroxy-phenyl)-{[(3-hydroxy-phenyl)-methoxycarbonyl-methyl]-methyl-amino}-methyl)-1-methyl-4-oxo-piperidine-3-carboxylic acid methyl ester | CHEMBL180074
TypeSmall organic molecule
Emp. Form.C25H28N2O7
Mol. Mass.468.499
SMILESCOC(=O)C12CN(C)CC(C(N(C)C1c1cccc(O)c1)c1cccc(O)c1)(C(=O)OC)C2=O