Reaction Details
TargetKappa-type opioid receptor
LigandBDBM50092520
Substrate/Competitorn/a
Meas. Tech.ChEMBL_145390 (CHEMBL750080)
Ki 140±n/a nM
Citation Siener, TCambareri, AKuhl, UEnglberger, WHaurand, MKögel, BHolzgrabe, U Synthesis and opioid receptor affinity of a series of 2, 4-diaryl-substituted 3,7-diazabicylononanones. J Med Chem43:3746-51 (2000) Kappa-type opioid receptor
Name:Kappa-type opioid receptor
Type:G Protein-Coupled Receptor (GPCR)
Mol. Mass.:42648.76
Organism:Homo sapiens (Human)
Description:P41145
Residue:380
BDBM50092520
NameBDBM50092520
Synonyms:3-((4-Fluoro-phenyl)-{[(4-fluoro-phenyl)-methoxycarbonyl-methyl]-methyl-amino}-methyl)-1-methyl-4-oxo-piperidine-3-carboxylic acid methyl ester | CHEMBL362207
TypeSmall organic molecule
Emp. Form.C25H26F2N2O5
Mol. Mass.472.4811
SMILESCOC(=O)C12CN(C)CC(C(N(C)C1c1ccc(F)cc1)c1ccc(F)cc1)(C(=O)OC)C2=O