Reaction Details
Target5-hydroxytryptamine receptor 4
LigandBDBM50092543
Substrate/Competitorn/a
Meas. Tech.ChEMBL_3569 (CHEMBL620702)
Ki 2.47±n/a nM
Citation Curtet, SSoulier, JLZahradnik, IGiner, MBerque-Bestel, IMialet, JLezoualc'h, FDonzeau-Gouge, PSicsic, SFischmeister, RLanglois, M New arylpiperazine derivatives as antagonists of the human cloned 5-HT(4) receptor isoforms. J Med Chem43:3761-9 (2000) 5-hydroxytryptamine receptor 4
Name:5-hydroxytryptamine receptor 4
Type:Enzyme
Mol. Mass.:43767.54
Organism:Homo sapiens (Human)
Description:Q13639
Residue:388
BDBM50092543
NameBDBM50092543
Synonyms:4-Amino-5-chloro-2-methoxy-benzoic acid 2-(4-pyrimidin-2-yl-piperazin-1-yl)-ethyl ester | CHEMBL121913
TypeSmall organic molecule
Emp. Form.C18H22ClN5O3
Mol. Mass.391.852
SMILESCOc1cc(N)c(Cl)cc1C(=O)OCCN1CCN(CC1)c1ncccn1