Reaction Details
Target5-hydroxytryptamine receptor 4
LigandBDBM50092549
Substrate/Competitorn/a
Meas. Tech.ChEMBL_3573 (CHEMBL620706)
Ki 16.8±n/a nM
Citation Curtet, SSoulier, JLZahradnik, IGiner, MBerque-Bestel, IMialet, JLezoualc'h, FDonzeau-Gouge, PSicsic, SFischmeister, RLanglois, M New arylpiperazine derivatives as antagonists of the human cloned 5-HT(4) receptor isoforms. J Med Chem43:3761-9 (2000) 5-hydroxytryptamine receptor 4
Name:5-hydroxytryptamine receptor 4
Type:Enzyme
Mol. Mass.:43767.54
Organism:Homo sapiens (Human)
Description:Q13639
Residue:388
BDBM50092549
NameBDBM50092549
Synonyms:4-Amino-5-chloro-2-methoxy-benzoic acid 2-[4-(2-fluoro-phenyl)-piperazin-1-yl]-ethyl ester | CHEMBL421256
TypeSmall organic molecule
Emp. Form.C20H23ClFN3O3
Mol. Mass.407.866
SMILESCOc1cc(N)c(Cl)cc1C(=O)OCCN1CCN(CC1)c1ccccc1F