Reaction Details
Target5-hydroxytryptamine receptor 4
LigandBDBM50092548
Substrate/Competitorn/a
Meas. Tech.ChEMBL_3573 (CHEMBL620706)
Ki 3.5±n/a nM
Citation Curtet, SSoulier, JLZahradnik, IGiner, MBerque-Bestel, IMialet, JLezoualc'h, FDonzeau-Gouge, PSicsic, SFischmeister, RLanglois, M New arylpiperazine derivatives as antagonists of the human cloned 5-HT(4) receptor isoforms. J Med Chem43:3761-9 (2000) 5-hydroxytryptamine receptor 4
Name:5-hydroxytryptamine receptor 4
Type:Enzyme
Mol. Mass.:43767.54
Organism:Homo sapiens (Human)
Description:Q13639
Residue:388
BDBM50092548
NameBDBM50092548
Synonyms:4-Amino-5-chloro-2-methoxy-benzoic acid 2-(4-pyridin-4-yl-piperazin-1-yl)-ethyl ester | CHEMBL122914
TypeSmall organic molecule
Emp. Form.C19H23ClN4O3
Mol. Mass.390.864
SMILESCOc1cc(N)c(Cl)cc1C(=O)OCCN1CCN(CC1)c1ccncc1