Reaction Details
Target5-hydroxytryptamine receptor 4
LigandBDBM50092557
Substrate/Competitorn/a
Meas. Tech.ChEMBL_3573 (CHEMBL620706)
Ki 17.7±n/a nM
Citation Curtet, SSoulier, JLZahradnik, IGiner, MBerque-Bestel, IMialet, JLezoualc'h, FDonzeau-Gouge, PSicsic, SFischmeister, RLanglois, M New arylpiperazine derivatives as antagonists of the human cloned 5-HT(4) receptor isoforms. J Med Chem43:3761-9 (2000) 5-hydroxytryptamine receptor 4
Name:5-hydroxytryptamine receptor 4
Type:Enzyme
Mol. Mass.:43767.54
Organism:Homo sapiens (Human)
Description:Q13639
Residue:388
BDBM50092557
NameBDBM50092557
Synonyms:4-Amino-5-chloro-2-methoxy-benzoic acid 2-[4-(4-methoxy-phenyl)-piperazin-1-yl]-ethyl ester | CHEMBL339936
TypeSmall organic molecule
Emp. Form.C21H26ClN3O4
Mol. Mass.419.902
SMILESCOc1ccc(cc1)N1CCN(CCOC(=O)c2cc(Cl)c(N)cc2OC)CC1