Reaction Details
Target5-hydroxytryptamine receptor 4
LigandBDBM29526
Substrate/Competitorn/a
Meas. Tech.ChEMBL_3567 (CHEMBL620701)
Ki 8.4±n/a nM
Citation Curtet, SSoulier, JLZahradnik, IGiner, MBerque-Bestel, IMialet, JLezoualc'h, FDonzeau-Gouge, PSicsic, SFischmeister, RLanglois, M New arylpiperazine derivatives as antagonists of the human cloned 5-HT(4) receptor isoforms. J Med Chem43:3761-9 (2000) 5-hydroxytryptamine receptor 4
Name:5-hydroxytryptamine receptor 4
Type:Enzyme
Mol. Mass.:43767.54
Organism:Homo sapiens (Human)
Description:Q13639
Residue:388
BDBM29526
NameBDBM29526
Synonyms:2-Piperidinoethyl 4-amino-5-chloro-2-methoxybenzoate ML 10302 | ML10302
TypeSmall organic molecule
Emp. Form.C15H21ClN2O3
Mol. Mass.312.792
SMILESCOc1cc(N)c(Cl)cc1C(=O)OCCN1CCCCC1