Reaction Details
Target5-hydroxytryptamine receptor 4
LigandBDBM50092558
Substrate/Competitorn/a
Meas. Tech.ChEMBL_3573 (CHEMBL620706)
Ki 9.8±n/a nM
Citation Curtet, SSoulier, JLZahradnik, IGiner, MBerque-Bestel, IMialet, JLezoualc'h, FDonzeau-Gouge, PSicsic, SFischmeister, RLanglois, M New arylpiperazine derivatives as antagonists of the human cloned 5-HT(4) receptor isoforms. J Med Chem43:3761-9 (2000) 5-hydroxytryptamine receptor 4
Name:5-hydroxytryptamine receptor 4
Type:Enzyme
Mol. Mass.:43767.54
Organism:Homo sapiens (Human)
Description:Q13639
Residue:388
BDBM50092558
NameBDBM50092558
Synonyms:4-Amino-5-chloro-2-methoxy-benzoic acid 2-[4-(2-chloro-pyrimidin-5-yl)-piperazin-1-yl]-ethyl ester | CHEMBL125716
TypeSmall organic molecule
Emp. Form.C18H21Cl2N5O3
Mol. Mass.426.297
SMILESCOc1cc(N)c(Cl)cc1C(=O)OCCN1CCN(CC1)c1cnc(Cl)nc1