Reaction Details
TargetCannabinoid receptor 1
LigandBDBM50092579
Substrate/Competitorn/a
Meas. Tech.ChEMBL_46458 (CHEMBL657905)
Ki>10000±n/a nM
Citation Mahadevan, ASiegel, CMartin, BRAbood, MEBeletskaya, IRazdan, RK Novel cannabinol probes for CB1 and CB2 cannabinoid receptors. J Med Chem43:3778-85 (2000) Cannabinoid receptor 1
Name:Cannabinoid receptor 1
Type:G Protein-Coupled Receptor (GPCR)
Mol. Mass.:52868.96
Organism:Homo sapiens (Human)
Description:P21554
Residue:472
BDBM50092579
NameBDBM50092579
Synonyms:3-(1,1-Dimethyl-heptyl)-1-methoxy-6,6-dimethyl-6H-benzo[c]chromene-9-carboxylic acid naphthalen-2-ylmethyl ester | CHEMBL122178
TypeSmall organic molecule
Emp. Form.C37H42O4
Mol. Mass.550.727
SMILESCCCCCCC(C)(C)c1cc(OC)c-2c(OC(C)(C)c3ccc(cc-23)C(=O)OCc2ccc3ccccc3c2)c1