Reaction Details
TargetCannabinoid receptor 1
LigandBDBM50061108
Substrate/Competitorn/a
Meas. Tech.ChEMBL_46458 (CHEMBL657905)
Ki 0.10±n/a nM
Citation Mahadevan, ASiegel, CMartin, BRAbood, MEBeletskaya, IRazdan, RK Novel cannabinol probes for CB1 and CB2 cannabinoid receptors. J Med Chem43:3778-85 (2000) Cannabinoid receptor 1
Name:Cannabinoid receptor 1
Type:G Protein-Coupled Receptor (GPCR)
Mol. Mass.:52868.96
Organism:Homo sapiens (Human)
Description:P21554
Residue:472
BDBM50061108
NameBDBM50061108
Synonyms:3-(1,1-Dimethyl-heptyl)-9-hydroxymethyl-6,6-dimethyl-6H-benzo[c]chromen-1-ol | CHEMBL111724
TypeSmall organic molecule
Emp. Form.C25H34O3
Mol. Mass.382.5357
SMILESCCCCCCC(C)(C)c1cc(O)c-2c(OC(C)(C)c3ccc(CO)cc-23)c1