Reaction Details
TargetCannabinoid receptor 1
LigandBDBM50092593
Substrate/Competitorn/a
Meas. Tech.ChEMBL_46458 (CHEMBL657905)
Ki>10000±n/a nM
Citation Mahadevan, ASiegel, CMartin, BRAbood, MEBeletskaya, IRazdan, RK Novel cannabinol probes for CB1 and CB2 cannabinoid receptors. J Med Chem43:3778-85 (2000) Cannabinoid receptor 1
Name:Cannabinoid receptor 1
Type:G Protein-Coupled Receptor (GPCR)
Mol. Mass.:52868.96
Organism:Homo sapiens (Human)
Description:P21554
Residue:472
BDBM50092593
NameBDBM50092593
Synonyms:3-(1,1-Dimethyl-heptyl)-1-methoxy-6,6-dimethyl-6H-benzo[c]chromene-9-carboxylic acid benzyl ester | CHEMBL442211
TypeSmall organic molecule
Emp. Form.C33H40O4
Mol. Mass.500.6683
SMILESCCCCCCC(C)(C)c1cc(OC)c-2c(OC(C)(C)c3ccc(cc-23)C(=O)OCc2ccccc2)c1