Reaction Details
TargetCannabinoid receptor 2
LigandBDBM50092588
Substrate/Competitorn/a
Meas. Tech.ChEMBL_46990 (CHEMBL658959)
Ki 3±n/a nM
Citation Mahadevan, ASiegel, CMartin, BRAbood, MEBeletskaya, IRazdan, RK Novel cannabinol probes for CB1 and CB2 cannabinoid receptors. J Med Chem43:3778-85 (2000) Cannabinoid receptor 2
Name:Cannabinoid receptor 2
Type:G Protein-Coupled Receptor (GPCR)
Mol. Mass.:39690.94
Organism:Homo sapiens (Human)
Description:P34972
Residue:360
BDBM50092588
NameBDBM50092588
Synonyms:4-(1,1-Dimethyl-heptyl)-2'-isopropyl-5'-methyl-biphenyl-2-ol | CHEMBL125061
TypeSmall organic molecule
Emp. Form.C25H36O
Mol. Mass.352.5527
SMILESCCCCCCC(C)(C)c1ccc(c(O)c1)-c1cc(C)ccc1C(C)C