Reaction Details
TargetcAMP-specific 3',5'-cyclic phosphodiesterase 4A
LigandBDBM50092632
Substrate/Competitorn/a
Meas. Tech.ChEMBL_155660 (CHEMBL763044)
IC50 0.07±n/a nM
Citation Macdonald, DPerrier, HLiu, SLaliberté, FRasori, RRobichaud, AMasson, PHuang, Z Hunting the emesis and efficacy targets of PDE4 inhibitors: identification of the photoaffinity probe 8-(3-azidophenyl)-6- [(4-iodo-1H-1-imidazolyl)methyl]quinoline (APIIMQ). J Med Chem43:3820-3 (2000) cAMP-specific 3',5'-cyclic phosphodiesterase 4A
Name:cAMP-specific 3',5'-cyclic phosphodiesterase 4A
Type:Enzyme
Mol. Mass.:98113.27
Organism:Homo sapiens (Human)
Description:P27815
Residue:886
BDBM50092632
NameBDBM50092632
Synonyms:8-(3-Nitro-phenyl)-6-pyridin-4-ylmethyl-quinoline CHEMBL127944
TypeSmall organic molecule
Emp. Form.C21H15N3O2
Mol. Mass.341.3627
SMILES[O-][N+](=O)c1cccc(c1)-c1cc(Cc2ccncc2)cc2cccnc12