Reaction Details
TargetDelta-type opioid receptor
LigandBDBM50092663
Substrate/Competitorn/a
Meas. Tech.ChEMBL_145322 (CHEMBL750410)
IC50>2000±n/a nM
Citation Plobeck, NDelorme, DWei, ZYYang, HZhou, FSchwarz, PGawell, LGagnon, HPelcman, BSchmidt, RYue, SYWalpole, CBrown, WZhou, ELabarre, MPayza, KSt-Onge, SKamassah, AMorin, PEProjean, DDucharme, JRoberts, E New diarylmethylpiperazines as potent and selective nonpeptidic delta opioid receptor agonists with increased In vitro metabolic stability. J Med Chem43:3878-94 (2000) Delta-type opioid receptor
Name:Delta-type opioid receptor
Type:G Protein-Coupled Receptor (GPCR)
Mol. Mass.:40382.98
Organism:Homo sapiens (Human)
Description:Competition binding assays were carried out using membrane preparations from transfected HN9.10 cells that constitutively expressed the delta opioid receptor.
Residue:372
BDBM50092663
NameBDBM50092663
Synonyms:4-[(4-Acetyl-piperazin-1-yl)-phenyl-methyl]-N,N-diethyl-benzamide | CHEMBL127369
TypeSmall organic molecule
Emp. Form.C24H31N3O2
Mol. Mass.393.5218
SMILESCCN(CC)C(=O)c1ccc(cc1)C(N1CCN(CC1)C(C)=O)c1ccccc1